Home » Java » java – JDK 9+: Modular project with SQLite JDBC driver?-Exceptionshub

java – JDK 9+: Modular project with SQLite JDBC driver?-Exceptionshub

Posted by: admin February 25, 2020 Leave a comment

Questions:

I am making a JavaFX program and creating a runnable with jlink.
But I have one problem: I can’t use the SQLite JDBC driver because it is an old jar file (non-modular). It doesn’t work as automodule.
This is the error I have when trying to use it as automodule (requires sqlite.jdbc;)

module-info.java:

module nl.myprogram {
    requires javafx.controls;
    requires javafx.fxml;
    requires transitive javafx.graphics;
    requires transitive java.sql;
    requires sqlite.jdbc; // <--- !!

    opens nl.myprogram to javafx.fxml;
    exports nl.myprogram;
}

Error when running clean javafx:jlink:

[WARNING] **********************************************************************************************************************************************
[WARNING] * Required filename-based automodules detected: [sqlite-jdbc-3.30.1.jar]. Please don't publish this project to a public artifact repository! *
[WARNING] **********************************************************************************************************************************************
[INFO] Changes detected - recompiling the module!
[INFO] Compiling 4 source files to C:\Users\MYNAME\Programeren\Workspace's\Workspace JavaFX\PROJECTNAME\target\classes
[WARNING] Required filename-based automodules detected. Please don't publish this project to a public artifact repository!
Error: automatic module cannot be used with jlink: sqlite.jdbc from file:///C:/Users/MYNAME/.m2/repository/org/xerial/sqlite-jdbc/3.30.1/sqlite-jdbc-3.30.1.jar
[ERROR] Command execution failed.
org.apache.commons.exec.ExecuteException: Process exited with an error: 1 (Exit value: 1)
    at org.apache.commons.exec.DefaultExecutor.executeInternal(DefaultExecutor.java:404)
    at org.apache.commons.exec.DefaultExecutor.execute(DefaultExecutor.java:166)
    at org.openjfx.JavaFXBaseMojo.executeCommandLine(JavaFXBaseMojo.java:491)
    at org.openjfx.JavaFXBaseMojo.executeCommandLine(JavaFXBaseMojo.java:453)
    at org.openjfx.JavaFXJLinkMojo.execute(JavaFXJLinkMojo.java:183)
    at org.apache.maven.plugin.DefaultBuildPluginManager.executeMojo(DefaultBuildPluginManager.java:137)
    at org.apache.maven.lifecycle.internal.MojoExecutor.execute(MojoExecutor.java:210)
    at org.apache.maven.lifecycle.internal.MojoExecutor.execute(MojoExecutor.java:156)
    at org.apache.maven.lifecycle.internal.MojoExecutor.execute(MojoExecutor.java:148)
    at org.apache.maven.lifecycle.internal.LifecycleModuleBuilder.buildProject(LifecycleModuleBuilder.java:117)
    at org.apache.maven.lifecycle.internal.LifecycleModuleBuilder.buildProject(LifecycleModuleBuilder.java:81)
    at org.apache.maven.lifecycle.internal.builder.singlethreaded.SingleThreadedBuilder.build(SingleThreadedBuilder.java:56)
    at org.apache.maven.lifecycle.internal.LifecycleStarter.execute(LifecycleStarter.java:128)
    at org.apache.maven.DefaultMaven.doExecute(DefaultMaven.java:305)
    at org.apache.maven.DefaultMaven.doExecute(DefaultMaven.java:192)
    at org.apache.maven.DefaultMaven.execute(DefaultMaven.java:105)
    at org.apache.maven.cli.MavenCli.execute(MavenCli.java:957)
    at org.apache.maven.cli.MavenCli.doMain(MavenCli.java:289)
    at org.apache.maven.cli.MavenCli.main(MavenCli.java:193)
    at java.base/jdk.internal.reflect.NativeMethodAccessorImpl.invoke0(Native Method)
    at java.base/jdk.internal.reflect.NativeMethodAccessorImpl.invoke(NativeMethodAccessorImpl.java:62)
    at java.base/jdk.internal.reflect.DelegatingMethodAccessorImpl.invoke(DelegatingMethodAccessorImpl.java:43)
    at java.base/java.lang.reflect.Method.invoke(Method.java:567)
    at org.codehaus.plexus.classworlds.launcher.Launcher.launchEnhanced(Launcher.java:282)
    at org.codehaus.plexus.classworlds.launcher.Launcher.launch(Launcher.java:225)
    at org.codehaus.plexus.classworlds.launcher.Launcher.mainWithExitCode(Launcher.java:406)
    at org.codehaus.plexus.classworlds.launcher.Launcher.main(Launcher.java:347)
org.apache.commons.exec.ExecuteException: Process exited with an error: 1 (Exit value: 1)
    at org.apache.commons.exec.DefaultExecutor.executeInternal(DefaultExecutor.java:404)
    at org.apache.commons.exec.DefaultExecutor.execute(DefaultExecutor.java:166)
    at org.openjfx.JavaFXBaseMojo.executeCommandLine(JavaFXBaseMojo.java:491)
    at org.openjfx.JavaFXBaseMojo.executeCommandLine(JavaFXBaseMojo.java:453)
    at org.openjfx.JavaFXJLinkMojo.execute(JavaFXJLinkMojo.java:183)
    at org.apache.maven.plugin.DefaultBuildPluginManager.executeMojo(DefaultBuildPluginManager.java:137)
    at org.apache.maven.lifecycle.internal.MojoExecutor.execute(MojoExecutor.java:210)
    at org.apache.maven.lifecycle.internal.MojoExecutor.execute(MojoExecutor.java:156)
    at org.apache.maven.lifecycle.internal.MojoExecutor.execute(MojoExecutor.java:148)
    at org.apache.maven.lifecycle.internal.LifecycleModuleBuilder.buildProject(LifecycleModuleBuilder.java:117)
    at org.apache.maven.lifecycle.internal.LifecycleModuleBuilder.buildProject(LifecycleModuleBuilder.java:81)
    at org.apache.maven.lifecycle.internal.builder.singlethreaded.SingleThreadedBuilder.build(SingleThreadedBuilder.java:56)
    at org.apache.maven.lifecycle.internal.LifecycleStarter.execute(LifecycleStarter.java:128)
    at org.apache.maven.DefaultMaven.doExecute(DefaultMaven.java:305)
    at org.apache.maven.DefaultMaven.doExecute(DefaultMaven.java:192)
    at org.apache.maven.DefaultMaven.execute(DefaultMaven.java:105)
    at org.apache.maven.cli.MavenCli.execute(MavenCli.java:957)
    at org.apache.maven.cli.MavenCli.doMain(MavenCli.java:289)
    at org.apache.maven.cli.MavenCli.main(MavenCli.java:193)
    at java.base/jdk.internal.reflect.NativeMethodAccessorImpl.invoke0(Native Method)
    at java.base/jdk.internal.reflect.NativeMethodAccessorImpl.invoke(NativeMethodAccessorImpl.java:62)
    at java.base/jdk.internal.reflect.DelegatingMethodAccessorImpl.invoke(DelegatingMethodAccessorImpl.java:43)
    at java.base/java.lang.reflect.Method.invoke(Method.java:567)
    at org.codehaus.plexus.classworlds.launcher.Launcher.launchEnhanced(Launcher.java:282)
    at org.codehaus.plexus.classworlds.launcher.Launcher.launch(Launcher.java:225)
    at org.codehaus.plexus.classworlds.launcher.Launcher.mainWithExitCode(Launcher.java:406)
    at org.codehaus.plexus.classworlds.launcher.Launcher.main(Launcher.java:347)
[INFO] ------------------------------------------------------------------------
[INFO] BUILD FAILURE
[INFO] ------------------------------------------------------------------------
[INFO] Total time:  3.903 s
[INFO] Finished at: 2020-02-18T14:20:50+01:00
[INFO] ------------------------------------------------------------------------
[ERROR] Failed to execute goal org.openjfx:javafx-maven-plugin:0.0.3:jlink (default-cli) on project PROJECTNAME: Error: Command execution failed. Process exited with an error: 1 (Exit value: 1) -> [Help 1]
[ERROR] 
[ERROR] To see the full stack trace of the errors, re-run Maven with the -e switch.
[ERROR] Re-run Maven using the -X switch to enable full debug logging.
[ERROR] 
[ERROR] For more information about the errors and possible solutions, please read the following articles:
[ERROR] [Help 1] http://cwiki.apache.org/confluence/display/MAVEN/MojoExecutionException

Important line from previous error log: Error: automatic module cannot be used with jlink: sqlite.jdbc from file:///C:/Users/MYNAME/.m2/repository/org/xerial/sqlite-jdbc/3.30.1/sqlite-jdbc-3.30.1.jar

Is there a way to fix this?

How to&Answers: